Reaction Details
TargetUrotensin-2 receptor
LigandBDBM50377229
Substrate/Competitorn/a
Meas. Tech.ChEMBL_479361 (CHEMBL921644)
Ki 5±n/a nM
Citation McAtee, JJDodson, JWDowdell, SEGirard, GRGoodman, KBHilfiker, MASehon, CASha, DWang, GZWang, NViet, AQZhang, DAiyar, NVBehm, DJCarballo, LHEvans, CAFries, HENagilla, RRoethke, TJXu, XYuan, CCDouglas, SANeeb, MJ Development of potent and selective small-molecule human Urotensin-II antagonists. Bioorg Med Chem Lett18:3500-3 (2008) 
 
Urotensin-2 receptor
Name:Urotensin-2 receptor
Type:Enzyme Catalytic Domain
Mol. Mass.:42159.71
Organism:Homo sapiens (Human)
Description:Urotensin-II UTS2R HUMAN::Q9UKP6
Residue:389
BDBM50377229
NameBDBM50377229
Synonyms:CHEMBL257150
TypeSmall organic molecule
Emp. Form.C25H28ClN3O3
Mol. Mass.453.961
SMILESClc1ccc2oc(=O)n(CC(=O)N3CCCC(C3CN3CCCC3)c3ccccc3)c2c1