Reaction Details
TargetCarbonic anhydrase 9
LigandBDBM10882
Substrate/Competitorn/a
Meas. Tech.ChEMBL_479526 (CHEMBL930512)
Ki 34±n/a nM
Citation Cecchi, ACiani, LWinum, JYMontero, JLScozzafava, ARistori, SSupuran, CT Carbonic anhydrase inhibitors: design of spin-labeled sulfonamides incorporating TEMPO moieties as probes for cytosolic or transmembrane isozymes. Bioorg Med Chem Lett18:3475-80 (2008) 
 
Carbonic anhydrase 9
Name:Carbonic anhydrase 9
Type:Enzyme
Mol. Mass.:49669.03
Organism:Homo sapiens (Human)
Description:Catalytic domain of human cloned isozyme was used in the assay
Residue:459
BDBM10882
NameBDBM10882
Synonyms:6-ethoxy-1,3-benzothiazole-2-sulfonamide Ethamide Ethoxzolamide Ethoxzolamide, EZM US10172837, Ethoxyzolamide | sulfonamide 3
TypeSmall organic molecule
Emp. Form.C9H10N2O3S2
Mol. Mass.258.317
SMILESCCOc1ccc2nc(sc2c1)S(N)(=O)=O