Reaction Details
TargetCarbonic anhydrase 2
LigandBDBM10890
Substrate/Competitorn/a
Meas. Tech.ChEMBL_479525 (CHEMBL924880)
Ki 15±n/a nM
Citation Cecchi, ACiani, LWinum, JYMontero, JLScozzafava, ARistori, SSupuran, CT Carbonic anhydrase inhibitors: design of spin-labeled sulfonamides incorporating TEMPO moieties as probes for cytosolic or transmembrane isozymes. Bioorg Med Chem Lett18:3475-80 (2008) 
 
Carbonic anhydrase 2
Name:Carbonic anhydrase 2
Type:Enzyme
Mol. Mass.:29250.71
Organism:Homo sapiens (Human)
Description:P00918
Residue:260
BDBM10890
NameBDBM10890
Synonyms:1-N-(3-chloro-1H-indol-7-yl)benzene-1,4-disulfonamide Compound 6 Indisulam (IND) | Sulfonamide, 7
TypeSmall organic molecule
Emp. Form.C14H12ClN3O4S2
Mol. Mass.385.846
SMILESNS(=O)(=O)c1ccc(cc1)S(=O)(=O)Nc1cccc2c(Cl)c[nH]c12