Reaction Details
TargetGlucocorticoid receptor
LigandBDBM50086551
Substrate/Competitorn/a
Meas. Tech.ChEMBL_479547 (CHEMBL931543)
IC50>1000±n/a nM
Citation Roach, SLHiguchi, RIAdams, MELiu, YKaranewsky, DSMarschke, KBMais, DEMiner, JNZhi, L Discovery of nonsteroidal glucocorticoid receptor ligands based on 6-indole-1,2,3,4-tetrahydroquinolines. Bioorg Med Chem Lett18:3504-8 (2008) 
 
Glucocorticoid receptor
Name:Glucocorticoid receptor
Type:Enzyme
Mol. Mass.:85656.87
Organism:Homo sapiens (Human)
Description:P04150
Residue:777
BDBM50086551
NameBDBM50086551
Synonyms:4-Methyl-5-(2,2,4-trimethyl-1,2,3,4-tetrahydro-quinolin-6-yl)-thiophene-2-carbonitrile racemic-4-methyl-5-(2,2,4-trimethyl-1,2,3,4-tetrahydroquinolin-6-yl)thiophene-2-carbonitrile
TypeSmall organic molecule
Emp. Form.C18H20N2S
Mol. Mass.296.43
SMILESCC1CC(C)(C)Nc2ccc(cc12)-c1sc(cc1C)C#N