Reaction Details
TargetProgesterone receptor
LigandBDBM50377338
Substrate/Competitorn/a
Meas. Tech.ChEMBL_479541 (CHEMBL931537)
Ki 151±n/a nM
Citation Roach, SLHiguchi, RIAdams, MELiu, YKaranewsky, DSMarschke, KBMais, DEMiner, JNZhi, L Discovery of nonsteroidal glucocorticoid receptor ligands based on 6-indole-1,2,3,4-tetrahydroquinolines. Bioorg Med Chem Lett18:3504-8 (2008) 
 
Progesterone receptor
Name:Progesterone receptor
Type:Protein
Mol. Mass.:98979.52
Organism:Homo sapiens (Human)
Description:P06401
Residue:933
BDBM50377338
NameBDBM50377338
Synonyms:CHEMBL429842
TypeSmall organic molecule
Emp. Form.C21H21ClF2N2
Mol. Mass.374.855
SMILESCC1CC(C)(C)Nc2c(C)cc(c(Cl)c12)-c1cc(F)c(F)c2cc[nH]c12