Reaction Details
TargetGlucocorticoid receptor
LigandBDBM50377346
Substrate/Competitorn/a
Meas. Tech.ChEMBL_479545 (CHEMBL931541)
IC50>1000±n/a nM
Citation Roach, SLHiguchi, RIAdams, MELiu, YKaranewsky, DSMarschke, KBMais, DEMiner, JNZhi, L Discovery of nonsteroidal glucocorticoid receptor ligands based on 6-indole-1,2,3,4-tetrahydroquinolines. Bioorg Med Chem Lett18:3504-8 (2008) 
 
Glucocorticoid receptor
Name:Glucocorticoid receptor
Type:Enzyme
Mol. Mass.:85656.87
Organism:Homo sapiens (Human)
Description:P04150
Residue:777
BDBM50377346
NameBDBM50377346
Synonyms:CHEMBL403274
TypeSmall organic molecule
Emp. Form.C21H22ClFN2
Mol. Mass.356.864
SMILESCC1CC(C)(C)Nc2c(C)cc(c(Cl)c12)-c1cc(F)cc2cc[nH]c12