Reaction Details
TargetAndrogen receptor
LigandBDBM50377338
Substrate/Competitorn/a
Meas. Tech.ChEMBL_479549 (CHEMBL931545)
Ki 50±n/a nM
Citation Roach, SLHiguchi, RIAdams, MELiu, YKaranewsky, DSMarschke, KBMais, DEMiner, JNZhi, L Discovery of nonsteroidal glucocorticoid receptor ligands based on 6-indole-1,2,3,4-tetrahydroquinolines. Bioorg Med Chem Lett18:3504-8 (2008) 
 
Androgen receptor
Name:Androgen receptor
Type:Receptor
Mol. Mass.:99185.27
Organism:Homo sapiens (Human)
Description:CHO cells were stably transfected with human AR gene.
Residue:920
BDBM50377338
NameBDBM50377338
Synonyms:CHEMBL429842
TypeSmall organic molecule
Emp. Form.C21H21ClF2N2
Mol. Mass.374.855
SMILESCC1CC(C)(C)Nc2c(C)cc(c(Cl)c12)-c1cc(F)c(F)c2cc[nH]c12