Reaction Details
TargetTransient receptor potential cation channel subfamily V member 1
LigandBDBM50377667
Substrate/Competitorn/a
Meas. Tech.ChEMBL_479900 (CHEMBL935753)
EC50>100000±n/a nM
Citation Ortar, GSchiano Moriello, ACascio, MGDe Petrocellis, LLigresti, AMorera, ENalli, MDi Marzo, V New tetrazole-based selective anandamide uptake inhibitors. Bioorg Med Chem Lett18:2820-4 (2008) 
 
Transient receptor potential cation channel subfamily V member 1
Name:Transient receptor potential cation channel subfamily V member 1
Type:Protein
Mol. Mass.:94960.75
Organism:Homo sapiens (Human)
Description:Q8NER1
Residue:839
BDBM50377667
NameBDBM50377667
Synonyms:CHEMBL257778
TypeSmall organic molecule
Emp. Form.C18H17N5O2
Mol. Mass.335.3599
SMILESCC(=O)Cn1nnc(CNC(=O)c2ccc(cc2)-c2ccccc2)n1