Reaction Details
TargetAdenosine receptor A1
LigandBDBM21221
Substrate/Competitorn/a
Meas. Tech.ChEMBL_479902 (CHEMBL935755)
Ki 35±n/a nM
Citation Melman, AGao, ZGKumar, DWan, TCGizewski, EAuchampach, JAJacobson, KA Design of (N)-methanocarba adenosine 5'-uronamides as species-independent A3 receptor-selective agonists. Bioorg Med Chem Lett18:2813-9 (2008) 
 
Adenosine receptor A1
Name:Adenosine receptor A1
Type:PROTEIN
Mol. Mass.:36646.06
Organism:Mus musculus
Description:ChEMBL_479902
Residue:326
BDBM21221
NameBDBM21221
Synonyms:(2S,3S,4R,5R)-5-(2-chloro-6-{[(3-iodophenyl)methyl]amino}-9H-purin-9-yl)-3,4-dihydroxy-N-methyloxolane-2-carboxamide 2-chloro-N6-(3-iodobenzyl)adenosine-5-N-methylcarboxamide C1-IB-MECA CI-IB-MECA US20230364057, Compound 76
TypeSmall organic molecule
Emp. Form.C18H18ClIN6O4
Mol. Mass.544.731
SMILESCNC(=O)[C@H]1O[C@H]([C@H](O)[C@@H]1O)n1cnc2c(NCc3cccc(I)c3)nc(Cl)nc12