Reaction Details
TargetAdenosine receptor A1
LigandBDBM50100418
Substrate/Competitorn/a
Meas. Tech.ChEMBL_479902 (CHEMBL935755)
Ki 7.3±n/a nM
Citation Melman, AGao, ZGKumar, DWan, TCGizewski, EAuchampach, JAJacobson, KA Design of (N)-methanocarba adenosine 5'-uronamides as species-independent A3 receptor-selective agonists. Bioorg Med Chem Lett18:2813-9 (2008) 
 
Adenosine receptor A1
Name:Adenosine receptor A1
Type:PROTEIN
Mol. Mass.:36646.06
Organism:Mus musculus
Description:ChEMBL_479902
Residue:326
BDBM50100418
NameBDBM50100418
Synonyms:(1S,2R,3S,4R,5S)-4-(6-(3-iodobenzylamino)-2-chloro-9H-purin-9-yl)-2,3-dihydroxy-N-methylbicyclo[3.1.0]hexane-1-carboxamide 1N-methyl-4-[2-chloro-6-(3-iodobenzylamino)-9H-9-purinyl]-2,3-dihydroxy-(1S,2R,3S,4R,5S)-bicyclo[3.1.0]hexane-1-carboxamide | CHEMBL27376
TypeSmall organic molecule
Emp. Form.C20H20ClIN6O3
Mol. Mass.554.769
SMILESCNC(=O)[C@@]12C[C@@H]1[C@H]([C@H](O)[C@@H]2O)n1cnc2c(NCc3cccc(I)c3)nc(Cl)nc12