Reaction Details
TargetAdenosine receptor A3
LigandBDBM50377677
Substrate/Competitorn/a
Meas. Tech.ChEMBL_479904 (CHEMBL935757)
Ki 4.7±n/a nM
Citation Melman, AGao, ZGKumar, DWan, TCGizewski, EAuchampach, JAJacobson, KA Design of (N)-methanocarba adenosine 5'-uronamides as species-independent A3 receptor-selective agonists. Bioorg Med Chem Lett18:2813-9 (2008) 
 
Adenosine receptor A3
Name:Adenosine receptor A3
Type:PROTEIN
Mol. Mass.:36460.91
Organism:Mus musculus
Description:ChEMBL_1515686
Residue:319
BDBM50377677
NameBDBM50377677
Synonyms:CHEMBL436649
TypeSmall organic molecule
Emp. Form.C27H29ClN6O5
Mol. Mass.553.009
SMILESCNC(=O)[C@@]12C[C@@H]1[C@H]([C@H](O)[C@@H]2O)n1cnc2c(NCc3cccc(Cl)c3)nc(nc12)C#CCCCC(=O)OC