Reaction Details
TargetAdenosine receptor A3
LigandBDBM50377685
Substrate/Competitorn/a
Meas. Tech.ChEMBL_479904 (CHEMBL935757)
Ki 14±n/a nM
Citation Melman, AGao, ZGKumar, DWan, TCGizewski, EAuchampach, JAJacobson, KA Design of (N)-methanocarba adenosine 5'-uronamides as species-independent A3 receptor-selective agonists. Bioorg Med Chem Lett18:2813-9 (2008) 
 
Adenosine receptor A3
Name:Adenosine receptor A3
Type:PROTEIN
Mol. Mass.:36460.91
Organism:Mus musculus
Description:ChEMBL_1515686
Residue:319
BDBM50377685
NameBDBM50377685
Synonyms:CHEMBL256520
TypeSmall organic molecule
Emp. Form.C26H27ClN6O5
Mol. Mass.538.983
SMILESCNC(=O)[C@@]12C[C@@H]1[C@H]([C@H](O)[C@@H]2O)n1cnc2c(NCc3cccc(c3)C#CCCCC(O)=O)nc(Cl)nc12