Reaction Details
TargetCannabinoid receptor 1
LigandBDBM50377692
Substrate/Competitorn/a
Meas. Tech.ChEMBL_479927 (CHEMBL929250)
Ki 1300±n/a nM
Citation Worm, KZhou, QJSaeui, CTGreen, RCCassel, JAStabley, GJDeHaven, RNConway-James, NLaBuda, CJKoblish, MLittle, PJDolle, RE Sulfamoyl benzamides as novel CB2 cannabinoid receptor ligands. Bioorg Med Chem Lett18:2830-5 (2008) 
 
Cannabinoid receptor 1
Name:Cannabinoid receptor 1
Type:G Protein-Coupled Receptor (GPCR)
Mol. Mass.:52868.96
Organism:Homo sapiens (Human)
Description:P21554
Residue:472
BDBM50377692
NameBDBM50377692
Synonyms:CHEMBL256503
TypeSmall organic molecule
Emp. Form.C16H23BrN2O4S
Mol. Mass.419.334
SMILESCC(C)(C)CNC(=O)c1ccc(Br)c(c1)S(=O)(=O)N1CCOCC1