Reaction Details
TargetCannabinoid receptor 2
LigandBDBM50377695
Substrate/Competitorn/a
Meas. Tech.ChEMBL_479928 (CHEMBL929251)
Ki 360±n/a nM
Citation Worm, KZhou, QJSaeui, CTGreen, RCCassel, JAStabley, GJDeHaven, RNConway-James, NLaBuda, CJKoblish, MLittle, PJDolle, RE Sulfamoyl benzamides as novel CB2 cannabinoid receptor ligands. Bioorg Med Chem Lett18:2830-5 (2008) 
 
Cannabinoid receptor 2
Name:Cannabinoid receptor 2
Type:G Protein-Coupled Receptor (GPCR)
Mol. Mass.:39690.94
Organism:Homo sapiens (Human)
Description:P34972
Residue:360
BDBM50377695
NameBDBM50377695
Synonyms:CHEMBL403627
TypeSmall organic molecule
Emp. Form.C19H21BrN2O3S
Mol. Mass.437.351
SMILESBrc1ccc(cc1S(=O)(=O)N1CCCCC1)C(=O)NCc1ccccc1