Reaction Details
TargetCannabinoid receptor 2
LigandBDBM50377697
Substrate/Competitorn/a
Meas. Tech.ChEMBL_479928 (CHEMBL929251)
Ki 200±n/a nM
Citation Worm, KZhou, QJSaeui, CTGreen, RCCassel, JAStabley, GJDeHaven, RNConway-James, NLaBuda, CJKoblish, MLittle, PJDolle, RE Sulfamoyl benzamides as novel CB2 cannabinoid receptor ligands. Bioorg Med Chem Lett18:2830-5 (2008) 
 
Cannabinoid receptor 2
Name:Cannabinoid receptor 2
Type:G Protein-Coupled Receptor (GPCR)
Mol. Mass.:39690.94
Organism:Homo sapiens (Human)
Description:P34972
Residue:360
BDBM50377697
NameBDBM50377697
Synonyms:CHEMBL256749
TypeSmall organic molecule
Emp. Form.C20H23BrN2O4S
Mol. Mass.467.377
SMILESCOc1cccc(CNC(=O)c2ccc(Br)c(c2)S(=O)(=O)N2CCCCC2)c1