Reaction Details
TargetCannabinoid receptor 1
LigandBDBM50377705
Substrate/Competitorn/a
Meas. Tech.ChEMBL_479927 (CHEMBL929250)
Ki 77±n/a nM
Citation Worm, KZhou, QJSaeui, CTGreen, RCCassel, JAStabley, GJDeHaven, RNConway-James, NLaBuda, CJKoblish, MLittle, PJDolle, RE Sulfamoyl benzamides as novel CB2 cannabinoid receptor ligands. Bioorg Med Chem Lett18:2830-5 (2008) 
 
Cannabinoid receptor 1
Name:Cannabinoid receptor 1
Type:G Protein-Coupled Receptor (GPCR)
Mol. Mass.:52868.96
Organism:Homo sapiens (Human)
Description:P21554
Residue:472
BDBM50377705
NameBDBM50377705
Synonyms:CHEMBL442447
TypeSmall organic molecule
Emp. Form.C24H34N2O4S
Mol. Mass.446.603
SMILESCC(NC(=O)c1ccc(C)c(c1)S(=O)(=O)N1CCOCC1)C12CC3CC(CC(C3)C1)C2