Reaction Details
TargetCannabinoid receptor 1
LigandBDBM50377708
Substrate/Competitorn/a
Meas. Tech.ChEMBL_479927 (CHEMBL929250)
Ki 93±n/a nM
Citation Worm, KZhou, QJSaeui, CTGreen, RCCassel, JAStabley, GJDeHaven, RNConway-James, NLaBuda, CJKoblish, MLittle, PJDolle, RE Sulfamoyl benzamides as novel CB2 cannabinoid receptor ligands. Bioorg Med Chem Lett18:2830-5 (2008) 
 
Cannabinoid receptor 1
Name:Cannabinoid receptor 1
Type:G Protein-Coupled Receptor (GPCR)
Mol. Mass.:52868.96
Organism:Homo sapiens (Human)
Description:P21554
Residue:472
BDBM50377708
NameBDBM50377708
Synonyms:CHEMBL256752
TypeSmall organic molecule
Emp. Form.C22H31BrN2O3S
Mol. Mass.483.462
SMILESCC1(C)[C@H]2CC[C@](C)(C2)[C@@H]1NC(=O)c1ccc(Br)c(c1)S(=O)(=O)N1CCCCC1