Reaction Details
TargetCannabinoid receptor 2
LigandBDBM50377704
Substrate/Competitorn/a
Meas. Tech.ChEMBL_479932 (CHEMBL929255)
EC50 14±n/a nM
Citation Worm, KZhou, QJSaeui, CTGreen, RCCassel, JAStabley, GJDeHaven, RNConway-James, NLaBuda, CJKoblish, MLittle, PJDolle, RE Sulfamoyl benzamides as novel CB2 cannabinoid receptor ligands. Bioorg Med Chem Lett18:2830-5 (2008) 
 
Cannabinoid receptor 2
Name:Cannabinoid receptor 2
Type:G Protein-Coupled Receptor (GPCR)
Mol. Mass.:39690.94
Organism:Homo sapiens (Human)
Description:P34972
Residue:360
BDBM50377704
NameBDBM50377704
Synonyms:CHEMBL255096
TypeSmall organic molecule
Emp. Form.C22H32N2O4S
Mol. Mass.420.565
SMILESCc1ccc(cc1S(=O)(=O)N1CCOCC1)C(=O)N[C@H]1CC2CC[C@@]1(C)C2(C)C