Reaction Details
TargetPolyunsaturated fatty acid lipoxygenase ALOX15
LigandBDBM50269774
Substrate/Competitorn/a
Meas. Tech.ChEMBL_502461 (CHEMBL986634)
IC50 14500±n/a nM
Citation Amagata, TWhitman, SJohnson, TAStessman, CCLoo, CPLobkovsky, EClardy, JCrews, PHolman, TR Exploring sponge-derived terpenoids for their potency and selectivity against 12-human, 15-human, and 15-soybean lipoxygenases. J Nat Prod66:230-5 (2003) 
 
Polyunsaturated fatty acid lipoxygenase ALOX15
Name:Polyunsaturated fatty acid lipoxygenase ALOX15
Type:Protein
Mol. Mass.:74804.05
Organism:Homo sapiens (Human)
Description:n/a
Residue:662
BDBM50269774
NameBDBM50269774
Synonyms:CHEMBL457171 | subersic acid
TypeSmall organic molecule
Emp. Form.C26H34O3
Mol. Mass.394.5464
SMILESCC1(C)CCC[C@]2(C)[C@@H]1CCC1=C2CC\C(C1)=C\Cc1cc(ccc1O)C(O)=O