Reaction Details
TargetPolyunsaturated fatty acid lipoxygenase ALOX15
LigandBDBM50240936
Substrate/Competitorn/a
Meas. Tech.ChEMBL_502461 (CHEMBL986634)
IC50 300±n/a nM
Citation Amagata, TWhitman, SJohnson, TAStessman, CCLoo, CPLobkovsky, EClardy, JCrews, PHolman, TR Exploring sponge-derived terpenoids for their potency and selectivity against 12-human, 15-human, and 15-soybean lipoxygenases. J Nat Prod66:230-5 (2003) 
 
Polyunsaturated fatty acid lipoxygenase ALOX15
Name:Polyunsaturated fatty acid lipoxygenase ALOX15
Type:Protein
Mol. Mass.:74804.05
Organism:Homo sapiens (Human)
Description:n/a
Residue:662
BDBM50240936
NameBDBM50240936
Synonyms:2-[(2E,6E)-3,7-Dimethyl-9-(2,6,6-trimethyl-cyclohex-1-enyl)-nona-2,6-dienyl]-benzene-1,4-diol JASPAQUINOL | jasplaquinol
TypeSmall organic molecule
Emp. Form.C26H38O2
Mol. Mass.382.5787
SMILESC\C(CC\C=C(/C)CCC1=C(C)CCCC1(C)C)=C/Cc1cc(O)ccc1O