Reaction Details
TargetAcetylcholinesterase
LigandBDBM50271323
Substrate/Competitorn/a
Meas. Tech.ChEMBL_552457 (CHEMBL1002717)
Ki 20.9±n/a nM
Citation Butini, SCampiani, GBorriello, MGemma, SPanico, APersico, MCatalanotti, BRos, SBrindisi, MAgnusdei, MFiorini, INacci, VNovellino, EBelinskaya, TSaxena, AFattorusso, C Exploiting protein fluctuations at the active-site gorge of human cholinesterases: further optimization of the design strategy to develop extremely potent inhibitors. J Med Chem51:3154-70 (2008) 
 
Acetylcholinesterase
Name:Acetylcholinesterase
Type:Enzyme
Mol. Mass.:67792.70
Organism:Homo sapiens (Human)
Description:P22303
Residue:614
BDBM50271323
NameBDBM50271323
Synonyms:CHEMBL501587 | N-{4-[(1,2,3, 4-Tetrahydroacridin-9-yl)amino]butyl}-N-{3-[(1,2,3,4-tetrahydroacridin-9-yl)sulfanyl]propyl}acetamide
TypeSmall organic molecule
Emp. Form.C35H42N4OS
Mol. Mass.566.799
SMILESCC(=O)N(CCCCNc1c2CCCCc2nc2ccccc12)CCCSc1c2CCCCc2nc2ccccc12