Reaction Details
TargetAcetylcholinesterase
LigandBDBM50149891
Substrate/Competitorn/a
Meas. Tech.ChEMBL_555809 (CHEMBL965669)
Ki 37000±n/a nM
Citation Butini, SCampiani, GBorriello, MGemma, SPanico, APersico, MCatalanotti, BRos, SBrindisi, MAgnusdei, MFiorini, INacci, VNovellino, EBelinskaya, TSaxena, AFattorusso, C Exploiting protein fluctuations at the active-site gorge of human cholinesterases: further optimization of the design strategy to develop extremely potent inhibitors. J Med Chem51:3154-70 (2008) 
 
Acetylcholinesterase
Name:Acetylcholinesterase
Type:Enzyme
Mol. Mass.:67792.70
Organism:Homo sapiens (Human)
Description:P22303
Residue:614
BDBM50149891
NameBDBM50149891
Synonyms:2,2',2''-[1,2,3-BENZENE-TRIYLTRIS(OXY)]TRIS[N,N,N-TRIETHYLETHANAMINIUM] GALLAMINE
TypeSmall organic molecule
Emp. Form.C30H60N3O3
Mol. Mass.510.8141
SMILESCC[N+](CC)(CC)CCOc1cccc(OCC[N+](CC)(CC)CC)c1OCC[N+](CC)(CC)CC