Reaction Details
TargetAcetylcholinesterase
LigandBDBM50271470
Substrate/Competitorn/a
Meas. Tech.ChEMBL_552457 (CHEMBL1002717)
Ki 0.119±n/a nM
Citation Butini, SCampiani, GBorriello, MGemma, SPanico, APersico, MCatalanotti, BRos, SBrindisi, MAgnusdei, MFiorini, INacci, VNovellino, EBelinskaya, TSaxena, AFattorusso, C Exploiting protein fluctuations at the active-site gorge of human cholinesterases: further optimization of the design strategy to develop extremely potent inhibitors. J Med Chem51:3154-70 (2008) 
 
Acetylcholinesterase
Name:Acetylcholinesterase
Type:Enzyme
Mol. Mass.:67792.70
Organism:Homo sapiens (Human)
Description:P22303
Residue:614
BDBM50271470
NameBDBM50271470
Synonyms:CHEMBL499224 | N-(2-Hydroxyethyl)-N-(1,2,3,4-tetrahydroacridin-9-yl)-N-{3-[(1,2,3,4-tetrahydroacridin-9-yl)amino]propyl}-1,4-butanediamine
TypeSmall organic molecule
Emp. Form.C35H45N5O
Mol. Mass.551.7647
SMILESOCCN(CCCCNc1c2CCCCc2nc2ccccc12)CCCNc1c2CCCCc2nc2ccccc12