Reaction Details
TargetAcetylcholinesterase
LigandBDBM8976
Substrate/Competitorn/a
Meas. Tech.ChEMBL_552457 (CHEMBL1002717)
Ki 3.99±n/a nM
Citation Butini, SCampiani, GBorriello, MGemma, SPanico, APersico, MCatalanotti, BRos, SBrindisi, MAgnusdei, MFiorini, INacci, VNovellino, EBelinskaya, TSaxena, AFattorusso, C Exploiting protein fluctuations at the active-site gorge of human cholinesterases: further optimization of the design strategy to develop extremely potent inhibitors. J Med Chem51:3154-70 (2008) 
 
Acetylcholinesterase
Name:Acetylcholinesterase
Type:Enzyme
Mol. Mass.:67792.70
Organism:Homo sapiens (Human)
Description:P22303
Residue:614
BDBM8976
NameBDBM8976
Synonyms:CHEMBL175555 Tacrine Dimer 4l | methyl[3-(1,2,3,4-tetrahydroacridin-9-ylamino)propyl][4-(1,2,3,4-tetrahydroacridin-9-ylsulfanyl)butyl]amine
TypeSmall organic molecule
Emp. Form.C34H42N4S
Mol. Mass.538.789
SMILESCN(CCCCSc1c2CCCCc2nc2ccccc12)CCCNc1c2CCCCc2nc2ccccc12