Reaction Details
TargetCholinesterase
LigandBDBM8965
Substrate/Competitorn/a
Meas. Tech.ChEMBL_552458 (CHEMBL1002718)
Ki 12.1±n/a nM
Citation Butini, SCampiani, GBorriello, MGemma, SPanico, APersico, MCatalanotti, BRos, SBrindisi, MAgnusdei, MFiorini, INacci, VNovellino, EBelinskaya, TSaxena, AFattorusso, C Exploiting protein fluctuations at the active-site gorge of human cholinesterases: further optimization of the design strategy to develop extremely potent inhibitors. J Med Chem51:3154-70 (2008) 
 
Cholinesterase
Name:Cholinesterase
Type:Homotetramer
Mol. Mass.:68422.27
Organism:Homo sapiens (Human)
Description:P06276
Residue:602
BDBM8965
NameBDBM8965
Synonyms:CHEMBL338755 methylbis[3-(1,2,3,4-tetrahydroacridin-9-ylamino)propyl]amine
TypeSmall organic molecule
Emp. Form.C33H41N5
Mol. Mass.507.7121
SMILESCN(CCCNc1c2CCCCc2nc2ccccc12)CCCNc1c2CCCCc2nc2ccccc12