Reaction Details
TargetAcetylcholinesterase
LigandBDBM50061568
Substrate/Competitorn/a
Meas. Tech.ChEMBL_552464 (CHEMBL1002724)
Ki 21000±n/a nM
Citation Butini, SCampiani, GBorriello, MGemma, SPanico, APersico, MCatalanotti, BRos, SBrindisi, MAgnusdei, MFiorini, INacci, VNovellino, EBelinskaya, TSaxena, AFattorusso, C Exploiting protein fluctuations at the active-site gorge of human cholinesterases: further optimization of the design strategy to develop extremely potent inhibitors. J Med Chem51:3154-70 (2008) 
 
Acetylcholinesterase
Name:Acetylcholinesterase
Type:Enzyme
Mol. Mass.:68165.65
Organism:Mus musculus (mouse)
Description:n/a
Residue:614
BDBM50061568
NameBDBM50061568
Synonyms:2,2'-[(1,4-dioxobutane-1,4-diyl)bis(oxy)]bis(N,N,N-trimethylethanaminium) Dicholine succinate Succinocholine Succinylbischoline suxamethonium
TypeSmall organic molecule
Emp. Form.C14H30N2O4
Mol. Mass.290.3979
SMILESC[N+](C)(C)CCOC(=O)CCC(=O)OCC[N+](C)(C)C