Reaction Details
TargetAcetylcholinesterase
LigandBDBM50022772
Substrate/Competitorn/a
Meas. Tech.ChEMBL_552463 (CHEMBL1002723)
Kd 70000±n/a nM
Citation Butini, SCampiani, GBorriello, MGemma, SPanico, APersico, MCatalanotti, BRos, SBrindisi, MAgnusdei, MFiorini, INacci, VNovellino, EBelinskaya, TSaxena, AFattorusso, C Exploiting protein fluctuations at the active-site gorge of human cholinesterases: further optimization of the design strategy to develop extremely potent inhibitors. J Med Chem51:3154-70 (2008) 
 
Acetylcholinesterase
Name:Acetylcholinesterase
Type:n/a
Mol. Mass.:65900.74
Organism:Tetronarce californica (Pacific electric ray) (Torpedo californica)
Description:P04058
Residue:586
BDBM50022772
NameBDBM50022772
Synonyms:CHEMBL1025 Diisopropyl fluorophosphonate Diisopropyl phosphorofluoridate Diisopropylfluorophosphoric acid ester Fluorodiisopropyl phosphate Isofluorphate Isopropyl fluophosphate Neoglaucit bis(propan-2-yl) fluorophosphate | diisopropyl fluorophosphate
TypeSmall organic molecule
Emp. Form.C6H14FO3P
Mol. Mass.184.1457
SMILESCC(C)OP(F)(=O)OC(C)C