Reaction Details
TargetHistone deacetylase 3
LigandBDBM50238632
Substrate/Competitorn/a
Meas. Tech.ChEMBL_533707 (CHEMBL973329)
IC50 2.5±n/a nM
Citation Lahm, APaolini, CPallaoro, MNardi, MCJones, PNeddermann, PSambucini, SBottomley, MJLo Surdo, PCarfí, AKoch, UDe Francesco, RSteinkühler, CGallinari, P Unraveling the hidden catalytic activity of vertebrate class IIa histone deacetylases. Proc Natl Acad Sci U S A104:17335-40 (2007) 
 
Histone deacetylase 3
Name:Histone deacetylase 3
Type:Enzyme
Mol. Mass.:48829.55
Organism:Homo sapiens (Human)
Description:O15379
Residue:428
BDBM50238632
NameBDBM50238632
Synonyms:(6S,9S,12S,14aR)-6-((S)-sec-Butyl)-9-(1-methoxy-1H-indol-3-ylmethyl)-12-(6-oxo-octyl)-decahydro-4a,7,10,13-tetraaza-benzocyclododecene-5,8,11,14-tetraone ChEMBL_275631
TypeSmall organic molecule
Emp. Form.C34H49N5O6
Mol. Mass.623.7828
SMILESCC[C@H](C)[C@@H]1NC(=O)[C@H](Cc2cn(OC)c3ccccc23)NC(=O)[C@H](CCCCCC(=O)CC)NC(=O)[C@H]2CCCCN2C1=O