Reaction Details
TargetPlasminogen
LigandBDBM50240897
Substrate/Competitorn/a
Meas. Tech.ChEMBL_526583 (CHEMBL979307)
IC50 1500±n/a nM
Citation Osaki, NKoyano, TKowithayakorn, THayashi, MKomiyama, KIshibashi, M Sesquiterpenoids and plasmin-inhibitory flavonoids from Blumea balsamifera. J Nat Prod68:447-9 (2005) 
 
Plasminogen
Name:Plasminogen
Type:Enzyme
Mol. Mass.:90579.18
Organism:Homo sapiens (Human)
Description:n/a
Residue:810
BDBM50240897
NameBDBM50240897
Synonyms:2-(3,4-dihydroxyphenyl)-5-hydroxy-3,7-dimethoxy-4H-chromen-4-one CHEMBL164861 | Quercetin-3,7-dimethylether
TypeSmall organic molecule
Emp. Form.C17H14O7
Mol. Mass.330.2889
SMILESCOc1cc(O)c2c(c1)oc(-c1ccc(O)c(O)c1)c(OC)c2=O