Reaction Details
TargetSodium-dependent serotonin transporter
LigandBDBM50243190
Substrate/Competitorn/a
Meas. Tech.ChEMBL_492352 (CHEMBL948348)
Ki 89.7±n/a nM
Citation Jin, CNavarro, HAPage, KCarroll, FI Synthesis and monoamine transporter binding properties of 2beta-[3'-(substituted benzyl)isoxazol-5-yl]- and 2beta-[3'-methyl-4'-(substituted phenyl)isoxazol-5-yl]-3beta-(substituted phenyl)tropanes. Bioorg Med Chem16:6682-8 (2008) 
 
Sodium-dependent serotonin transporter
Name:Sodium-dependent serotonin transporter
Type:Multi-pass membrane protein
Mol. Mass.:70322.51
Organism:Homo sapiens (Human)
Description:P31645
Residue:630
BDBM50243190
NameBDBM50243190
Synonyms:3beta-(4-Methylphenyl)-2beta-[3'-(4-methylbenzyl)isoxazol-5-yl]-tropane hydrochloride salt | CHEMBL487873
TypeSmall organic molecule
Emp. Form.C26H30N2O
Mol. Mass.386.5292
SMILESCN1C2CCC1[C@H]([C@H](C2)c1ccc(C)cc1)c1cc(Cc2ccc(C)cc2)no1