Reaction Details
TargetGlutamate receptor ionotropic, kainate 3
LigandBDBM17660
Substrate/Competitorn/a
Meas. Tech.ChEMBL_487958 (CHEMBL1013089)
Ki 1670±n/a nM
Citation Sagot, EPickering, DSPu, XUmberti, MStensbøl, TBNielsen, BChapelet, MBolte, JGefflaut, TBunch, L Chemo-enzymatic synthesis of a series of 2,4-syn-functionalized (S)-glutamate analogues: new insight into the structure-activity relation of ionotropic glutamate receptor subtypes 5, 6, and 7. J Med Chem51:4093-103 (2008) 
 
Glutamate receptor ionotropic, kainate 3
Name:Glutamate receptor ionotropic, kainate 3
Type:PROTEIN
Mol. Mass.:104080.46
Organism:Rattus norvegicus
Description:ChEMBL_1447329
Residue:919
BDBM17660
NameBDBM17660
Synonyms:(2S)-2-amino-3-(3,5-dioxo-1,2,4-oxadiazolidin-2-yl)propanoic acid CHEMBL279956 Quisqualate, L | quisqualic acid
TypeSmall organic molecule
Emp. Form.C5H7N3O5
Mol. Mass.189.1262
SMILESN[C@@H](Cn1oc(=O)[nH]c1=O)C(O)=O