Reaction Details
TargetRAF proto-oncogene serine/threonine-protein kinase
LigandBDBM50077974
Substrate/Competitorn/a
Meas. Tech.ChEMBL_487988 (CHEMBL1013119)
IC50 56±n/a nM
Citation Laufer, SAHauser, DRDomeyer, DMKinkel, KLiedtke, AJ Design, synthesis, and biological evaluation of novel Tri- and tetrasubstituted imidazoles as highly potent and specific ATP-mimetic inhibitors of p38 MAP kinase: focus on optimized interactions with the enzyme's surface-exposed front region. J Med Chem51:4122-49 (2008) 
 
RAF proto-oncogene serine/threonine-protein kinase
Name:RAF proto-oncogene serine/threonine-protein kinase
Type:Serine/threonine-protein kinase
Mol. Mass.:73082.52
Organism:Homo sapiens (Human)
Description:P04049
Residue:648
BDBM50077974
NameBDBM50077974
Synonyms:4-(4-(4-chlorophenyl)-2-phenyl-1H-imidazol-5-yl)pyridine CHEMBL430419
TypeSmall organic molecule
Emp. Form.C20H14ClN3
Mol. Mass.331.798
SMILESClc1ccc(cc1)-c1[nH]c(nc1-c1ccncc1)-c1ccccc1