Reaction Details
TargetMitogen-activated protein kinase 14
LigandBDBM50251939
Substrate/Competitorn/a
Meas. Tech.ChEMBL_488009 (CHEMBL1013888)
IC50 42±n/a nM
Citation Laufer, SAHauser, DRDomeyer, DMKinkel, KLiedtke, AJ Design, synthesis, and biological evaluation of novel Tri- and tetrasubstituted imidazoles as highly potent and specific ATP-mimetic inhibitors of p38 MAP kinase: focus on optimized interactions with the enzyme's surface-exposed front region. J Med Chem51:4122-49 (2008) 
 
Mitogen-activated protein kinase 14
Name:Mitogen-activated protein kinase 14
Type:Serine/threonine-protein kinase
Mol. Mass.:41286.76
Organism:Homo sapiens (Human)
Description:Q16539
Residue:360
BDBM50251939
NameBDBM50251939
Synonyms:CHEMBL481943 | Cyclohexyl-{4-[4-(4-fluoro-phenyl)-3-(2-methoxy-ethyl)-2-methylsulfanyl-1H-imidazol-5-yl]-pyridin-2-yl}-amine
TypeSmall organic molecule
Emp. Form.C24H29FN4OS
Mol. Mass.440.577
SMILESCOCCn1c(SC)nc(c1-c1ccnc(NC2CCCCC2)c1)-c1ccc(F)cc1