Reaction Details
TargetMitogen-activated protein kinase 14
LigandBDBM50251936
Substrate/Competitorn/a
Meas. Tech.ChEMBL_488009 (CHEMBL1013888)
IC50 87±n/a nM
Citation Laufer, SAHauser, DRDomeyer, DMKinkel, KLiedtke, AJ Design, synthesis, and biological evaluation of novel Tri- and tetrasubstituted imidazoles as highly potent and specific ATP-mimetic inhibitors of p38 MAP kinase: focus on optimized interactions with the enzyme's surface-exposed front region. J Med Chem51:4122-49 (2008) 
 
Mitogen-activated protein kinase 14
Name:Mitogen-activated protein kinase 14
Type:Serine/threonine-protein kinase
Mol. Mass.:41286.76
Organism:Homo sapiens (Human)
Description:Q16539
Residue:360
BDBM50251936
NameBDBM50251936
Synonyms:2-Ethylsulfanyl-4-[4-(4-fluoro-phenyl)-2-methylsulfanyl-1H-imidazol-5-yl]-pyridine | CHEMBL516761
TypeSmall organic molecule
Emp. Form.C17H16FN3S2
Mol. Mass.345.457
SMILESCCSc1cc(ccn1)-c1nc(SC)[nH]c1-c1ccc(F)cc1