Reaction Details
TargetMitogen-activated protein kinase 14
LigandBDBM50251927
Substrate/Competitorn/a
Meas. Tech.ChEMBL_488009 (CHEMBL1013888)
IC50 20±n/a nM
Citation Laufer, SAHauser, DRDomeyer, DMKinkel, KLiedtke, AJ Design, synthesis, and biological evaluation of novel Tri- and tetrasubstituted imidazoles as highly potent and specific ATP-mimetic inhibitors of p38 MAP kinase: focus on optimized interactions with the enzyme's surface-exposed front region. J Med Chem51:4122-49 (2008) 
 
Mitogen-activated protein kinase 14
Name:Mitogen-activated protein kinase 14
Type:Serine/threonine-protein kinase
Mol. Mass.:41286.76
Organism:Homo sapiens (Human)
Description:Q16539
Residue:360
BDBM50251927
NameBDBM50251927
Synonyms:(1,5-Dimethyl-hexyl)-{4-[4-(4-fluoro-phenyl)-2-methylsulfanyl-1H-imidazol-5-yl]-pyridin-2-yl}-amine | CHEMBL518964
TypeSmall organic molecule
Emp. Form.C23H29FN4S
Mol. Mass.412.567
SMILESCSc1nc(c([nH]1)-c1ccc(F)cc1)-c1ccnc(NC(C)CCCC(C)C)c1