Reaction Details
TargetMitogen-activated protein kinase 14
LigandBDBM50251919
Substrate/Competitorn/a
Meas. Tech.ChEMBL_488009 (CHEMBL1013888)
IC50 34±n/a nM
Citation Laufer, SAHauser, DRDomeyer, DMKinkel, KLiedtke, AJ Design, synthesis, and biological evaluation of novel Tri- and tetrasubstituted imidazoles as highly potent and specific ATP-mimetic inhibitors of p38 MAP kinase: focus on optimized interactions with the enzyme's surface-exposed front region. J Med Chem51:4122-49 (2008) 
 
Mitogen-activated protein kinase 14
Name:Mitogen-activated protein kinase 14
Type:Serine/threonine-protein kinase
Mol. Mass.:41286.76
Organism:Homo sapiens (Human)
Description:Q16539
Residue:360
BDBM50251919
NameBDBM50251919
Synonyms:(1,2-Dimethyl-propyl)-{4-[2-methylsulfanyl-4-(3-trifluoromethyl-phenyl)-1H-imidazol-5-yl]-pyridin-2-yl}-amine | CHEMBL482111
TypeSmall organic molecule
Emp. Form.C21H23F3N4S
Mol. Mass.420.494
SMILESCSc1nc(c([nH]1)-c1cccc(c1)C(F)(F)F)-c1ccnc(NC(C)C(C)C)c1