Reaction Details
TargetFatty-acid amide hydrolase 1 [30-579]
LigandBDBM50157120
Substrate/Competitorn/a
Meas. Tech.ChEMBL_513860 (CHEMBL970754)
Ki 3±n/a nM
Citation Garfunkle, JEzzili, CRayl, TJHochstatter, DGHwang, IBoger, DL Optimization of the central heterocycle of alpha-ketoheterocycle inhibitors of fatty acid amide hydrolase. J Med Chem51:4392-403 (2008) 
 
Fatty-acid amide hydrolase 1 [30-579]
Name:Fatty-acid amide hydrolase 1 [30-579]
Type:Single-pass membrane protein; homodimer
Mol. Mass.:60474.00
Organism:Rattus norvegicus (rat)
Description:P97612 (aa 30-579)
Residue:550
BDBM50157120
NameBDBM50157120
Synonyms:(9Z)-1-(5-pyridin-2-yl-1,3,4-oxadiazol-2-yl)octadec-9-en-1-one (Z)-1-(5-Pyridin-2-yl-[1,3,4]oxadiazol-2-yl)-octadec-9-en-1-one 1-(5-Pyridin-2-yl-[1,3,4]oxadiazol-2-yl)-octadec-9-en-1-one | CHEMBL178563
TypeSmall organic molecule
Emp. Form.C25H37N3O2
Mol. Mass.411.5802
SMILESCCCCCCCC\C=C/CCCCCCCC(=O)c1nnc(o1)-c1ccccn1