Reaction Details
TargetFatty-acid amide hydrolase 1
LigandBDBM50161512
Substrate/Competitorn/a
Meas. Tech.ChEMBL_513864 (CHEMBL970758)
Ki 1.2±n/a nM
Citation Garfunkle, JEzzili, CRayl, TJHochstatter, DGHwang, IBoger, DL Optimization of the central heterocycle of alpha-ketoheterocycle inhibitors of fatty acid amide hydrolase. J Med Chem51:4392-403 (2008) 
 
Fatty-acid amide hydrolase 1
Name:Fatty-acid amide hydrolase 1
Type:Protein
Mol. Mass.:63071.19
Organism:Homo sapiens (Human)
Description:O00519
Residue:579
BDBM50161512
NameBDBM50161512
Synonyms:7-Phenyl-1-(5-(pyridin-2-yl)-1,3,4-oxadiazol-2-yl)-heptan-1-one 7-phenyl-1-(5-(pyridin-2-yl)-1,3,4-oxadiazol-2-yl)heptan-1-one | CHEMBL178398
TypeSmall organic molecule
Emp. Form.C20H21N3O2
Mol. Mass.335.3996
SMILESO=C(CCCCCCc1ccccc1)c1nnc(o1)-c1ccccn1