Reaction Details
TargetLiver carboxylesterase 1
LigandBDBM23120
Substrate/Competitorn/a
Meas. Tech.ChEMBL_513868 (CHEMBL970762)
IC50 600±n/a nM
Citation Garfunkle, JEzzili, CRayl, TJHochstatter, DGHwang, IBoger, DL Optimization of the central heterocycle of alpha-ketoheterocycle inhibitors of fatty acid amide hydrolase. J Med Chem51:4392-403 (2008) 
 
Liver carboxylesterase 1
Name:Liver carboxylesterase 1
Type:Protein
Mol. Mass.:62520.83
Organism:Homo sapiens (Human)
Description:n/a
Residue:567
BDBM23120
NameBDBM23120
Synonyms:7-phenyl-1-[5-(pyridin-2-yl)-1,3-oxazol-2-yl]heptan-1-one OL-135
TypeSmall organic molecule
Emp. Form.C21H22N2O2
Mol. Mass.334.4116
SMILESO=C(CCCCCCc1ccccc1)c1ncc(o1)-c1ccccn1