Reaction Details
TargetFatty-acid amide hydrolase 1 [30-579]
LigandBDBM50261936
Substrate/Competitorn/a
Meas. Tech.ChEMBL_513861 (CHEMBL970755)
pH9±n/a
Ki 1±n/a nM
Commentsextracted
Citation Garfunkle, JEzzili, CRayl, TJHochstatter, DGHwang, IBoger, DL Optimization of the central heterocycle of alpha-ketoheterocycle inhibitors of fatty acid amide hydrolase. J Med Chem51:4392-403 (2008) 
 
Fatty-acid amide hydrolase 1 [30-579]
Name:Fatty-acid amide hydrolase 1 [30-579]
Type:Single-pass membrane protein; homodimer
Mol. Mass.:60474.00
Organism:Rattus norvegicus (rat)
Description:P97612 (aa 30-579)
Residue:550
BDBM50261936
NameBDBM50261936
Synonyms:CHEMBL468188 | Methyl 5-(7-Phenylheptanoyl)-1,3,4-oxadiazole-2-carboxylate
TypeSmall organic molecule
Emp. Form.C17H20N2O4
Mol. Mass.316.3517
SMILESCOC(=O)c1nnc(o1)C(=O)CCCCCCc1ccccc1