Reaction Details
TargetCarbonic anhydrase 1
LigandBDBM50261758
Substrate/Competitorn/a
Meas. Tech.ChEMBL_514686 (CHEMBL976458)
Ki 6500±n/a nM
Citation Poulsen, SAWilkinson, BLInnocenti, AVullo, DSupuran, CT Inhibition of human mitochondrial carbonic anhydrases VA and VB with para-(4-phenyltriazole-1-yl)-benzenesulfonamide derivatives. Bioorg Med Chem Lett18:4624-7 (2008) 
 
Carbonic anhydrase 1
Name:Carbonic anhydrase 1
Type:Enzyme
Mol. Mass.:28873.37
Organism:Homo sapiens (Human)
Description:P00915
Residue:261
BDBM50261758
NameBDBM50261758
Synonyms:4-(4-(4-fluoro-3-methylphenyl)-1H-1,2,3-triazol-1-yl)benzenesulfonamide | CHEMBL467979
TypeSmall organic molecule
Emp. Form.C15H13FN4O2S
Mol. Mass.332.353
SMILESCc1cc(ccc1F)-c1cn(nn1)-c1ccc(cc1)S(N)(=O)=O