Reaction Details
TargetCarbonic anhydrase 2
LigandBDBM50262067
Substrate/Competitorn/a
Meas. Tech.ChEMBL_514687 (CHEMBL976459)
Ki 40.3±n/a nM
Citation Poulsen, SAWilkinson, BLInnocenti, AVullo, DSupuran, CT Inhibition of human mitochondrial carbonic anhydrases VA and VB with para-(4-phenyltriazole-1-yl)-benzenesulfonamide derivatives. Bioorg Med Chem Lett18:4624-7 (2008) 
 
Carbonic anhydrase 2
Name:Carbonic anhydrase 2
Type:Enzyme
Mol. Mass.:29250.71
Organism:Homo sapiens (Human)
Description:P00918
Residue:260
BDBM50262067
NameBDBM50262067
Synonyms:4-(4-(4-fluorophenyl)-1H-1,2,3-triazol-1-yl)benzenesulfonamide | CHEMBL468367
TypeSmall organic molecule
Emp. Form.C14H11FN4O2S
Mol. Mass.318.326
SMILESNS(=O)(=O)c1ccc(cc1)-n1cc(nn1)-c1ccc(F)cc1