Reaction Details
TargetCarbonic anhydrase 2
LigandBDBM50262015
Substrate/Competitorn/a
Meas. Tech.ChEMBL_514687 (CHEMBL976459)
Ki 7.7±n/a nM
Citation Poulsen, SAWilkinson, BLInnocenti, AVullo, DSupuran, CT Inhibition of human mitochondrial carbonic anhydrases VA and VB with para-(4-phenyltriazole-1-yl)-benzenesulfonamide derivatives. Bioorg Med Chem Lett18:4624-7 (2008) 
 
Carbonic anhydrase 2
Name:Carbonic anhydrase 2
Type:Enzyme
Mol. Mass.:29250.71
Organism:Homo sapiens (Human)
Description:P00918
Residue:260
BDBM50262015
NameBDBM50262015
Synonyms:4-(4-o-tolyl-1H-1,2,3-triazol-1-yl)benzenesulfonamide | CHEMBL445517
TypeSmall organic molecule
Emp. Form.C15H14N4O2S
Mol. Mass.314.362
SMILESCc1ccccc1-c1cn(nn1)-c1ccc(cc1)S(N)(=O)=O