Reaction Details
TargetCarbonic anhydrase 5A, mitochondrial
LigandBDBM50262065
Substrate/Competitorn/a
Meas. Tech.ChEMBL_514688 (CHEMBL976460)
Ki 10.6±n/a nM
Citation Poulsen, SAWilkinson, BLInnocenti, AVullo, DSupuran, CT Inhibition of human mitochondrial carbonic anhydrases VA and VB with para-(4-phenyltriazole-1-yl)-benzenesulfonamide derivatives. Bioorg Med Chem Lett18:4624-7 (2008) 
 
Carbonic anhydrase 5A, mitochondrial
Name:Carbonic anhydrase 5A, mitochondrial
Type:Enzyme
Mol. Mass.:34755.54
Organism:Homo sapiens (Human)
Description:Human (cloned) isozyme
Residue:305
BDBM50262065
NameBDBM50262065
Synonyms:4-(4-(4-methoxyphenyl)-1H-1,2,3-triazol-1-yl)benzenesulfonamide | CHEMBL513185
TypeSmall organic molecule
Emp. Form.C15H14N4O3S
Mol. Mass.330.362
SMILESCOc1ccc(cc1)-c1cn(nn1)-c1ccc(cc1)S(N)(=O)=O