Reaction Details
TargetCorticotropin-releasing factor receptor 1
LigandBDBM50272638
Substrate/Competitorn/a
Meas. Tech.ChEMBL_510098 (CHEMBL998752)
IC50 1±n/a nM
Citation Yoon, TDe Lombaert, SBrodbeck, RGulianello, MKrause, JEHutchison, AHorvath, RFGe, PKehne, JHoffman, DChandrasekhar, JDoller, DHodgetts, KJ 2-Arylpyrimidines: novel CRF-1 receptor antagonists. Bioorg Med Chem Lett18:4486-90 (2008) 
 
Corticotropin-releasing factor receptor 1
Name:Corticotropin-releasing factor receptor 1
Type:Enzyme
Mol. Mass.:50744.31
Organism:Homo sapiens (Human)
Description:P34998
Residue:444
BDBM50272638
NameBDBM50272638
Synonyms:2-(4-chloro-2,6-dimethoxyphenyl)-4-methoxy-6-methyl-N,N-dipropylpyrimidin-5-amine | CHEMBL525716
TypeSmall organic molecule
Emp. Form.C20H28ClN3O3
Mol. Mass.393.908
SMILESCCCN(CCC)c1c(C)nc(nc1OC)-c1c(OC)cc(Cl)cc1OC