Reaction Details
TargetTransporter
LigandBDBM50243991
Substrate/Competitorn/a
Meas. Tech.ChEMBL_491868 (CHEMBL946205)
IC50 92±n/a nM
Citation Zhang, MJovic, FVickers, TDyck, BTamiya, JGrey, JTran, JAFleck, BAPick, RFoster, ACChen, C Studies on the structure-activity relationship of bicifadine analogs as monoamine transporter inhibitors. Bioorg Med Chem Lett18:3682-6 (2008) 
 
Transporter
Name:Transporter
Type:Multi-pass membrane protein
Mol. Mass.:69236.90
Organism:Rattus norvegicus (rat)
Description:Q63380
Residue:617
BDBM50243991
NameBDBM50243991
Synonyms:(1S,5S)-1-(thiophen-2-yl)-3-aza-bicyclo[3.1.0]hexane | CHEMBL508156
TypeSmall organic molecule
Emp. Form.C9H11NS
Mol. Mass.165.255
SMILESC1[C@@H]2CNC[C@]12c1cccs1