Reaction Details
TargetTransporter
LigandBDBM50243943
Substrate/Competitorn/a
Meas. Tech.ChEMBL_491868 (CHEMBL946205)
IC50 360±n/a nM
Citation Zhang, MJovic, FVickers, TDyck, BTamiya, JGrey, JTran, JAFleck, BAPick, RFoster, ACChen, C Studies on the structure-activity relationship of bicifadine analogs as monoamine transporter inhibitors. Bioorg Med Chem Lett18:3682-6 (2008) 
 
Transporter
Name:Transporter
Type:Multi-pass membrane protein
Mol. Mass.:69236.90
Organism:Rattus norvegicus (rat)
Description:Q63380
Residue:617
BDBM50243943
NameBDBM50243943
Synonyms:1-Biphenyl-4-yl-3-aza-bicyclo[3.1.0]hexane | CHEMBL505313
TypeSmall organic molecule
Emp. Form.C17H17N
Mol. Mass.235.3236
SMILESC1C2CNCC12c1ccc(cc1)-c1ccccc1