Reaction Details
TargetSodium-dependent dopamine transporter
LigandBDBM22417
Substrate/Competitorn/a
Meas. Tech.ChEMBL_491607 (CHEMBL945183)
IC50 2400±n/a nM
Citation Wu, DPontillo, JChing, BHudson, SGao, YFleck, BAGogas, KWade, WS Discovery of a potent, selective, and less flexible selective norepinephrine reuptake inhibitor (sNRI). Bioorg Med Chem Lett18:4224-7 (2008) 
 
Sodium-dependent dopamine transporter
Name:Sodium-dependent dopamine transporter
Type:Multi-pass membrane protein
Mol. Mass.:68497.11
Organism:Homo sapiens (Human)
Description:Q01959
Residue:620
BDBM22417
NameBDBM22417
Synonyms:3-(2-methoxyphenoxy)-N-methyl-3-phenylpropan-1-amine LY 135252 LY135252 Nisoxetine US9944618, Compound ID No. 177 [3H]Nisoxetine
Typeradiolabeled ligand
Emp. Form.C17H21NO2
Mol. Mass.271.3541
SMILESCNCCC(Oc1ccccc1OC)c1ccccc1