Reaction Details
TargetSodium-dependent serotonin transporter
LigandBDBM50124566
Substrate/Competitorn/a
Meas. Tech.ChEMBL_535517 (CHEMBL986143)
IC50 242±n/a nM
Citation McComas, CCVu, ATMahaney, PECohn, STFensome, AMarella, MANogle, LTrybulski, EJYe, FZhang, PAlfinito, PBray, JJohnston, GKoury, EDeecher, DC Synthesis and activity of 1-(3-amino-1-phenylpropyl)indolin-2-ones: a new class of selective norepinephrine reuptake inhibitors. Bioorg Med Chem Lett18:4929-31 (2008) 
 
Sodium-dependent serotonin transporter
Name:Sodium-dependent serotonin transporter
Type:Multi-pass membrane protein
Mol. Mass.:70322.51
Organism:Homo sapiens (Human)
Description:P31645
Residue:630
BDBM50124566
NameBDBM50124566
Synonyms:(R)-2-((R)-(2-ethoxyphenoxy)(phenyl)methyl)morpholine 2-((2-ethoxyphenoxy)(phenyl)methyl)morpholine 2-[2-ethoxyphenoxy(phenyl)methyl]-1,4-oxazinane REBOXETINE | rac-syn-2-((2-ethoxyphenoxy)(phenyl)methyl)morpholine
TypeSmall organic molecule
Emp. Form.C19H23NO3
Mol. Mass.313.3908
SMILESCCOc1ccccc1OC(C1CNCCO1)c1ccccc1