Reaction Details
TargetKappa-type opioid receptor
LigandBDBM50274520
Substrate/Competitorn/a
Meas. Tech.ChEMBL_537686 (CHEMBL993480)
IC50 0.869±n/a nM
Citation Kawai, KHayakawa, JMiyamoto, TImamura, YYamane, SWakita, HFujii, HKawamura, KMatsuura, HIzumimoto, NKobayashi, REndo, TNagase, H Design, synthesis, and structure-activity relationship of novel opioid kappa-agonists. Bioorg Med Chem16:9188-201 (2008) 
 
Kappa-type opioid receptor
Name:Kappa-type opioid receptor
Type:Enzyme
Mol. Mass.:42656.78
Organism:Mus musculus (Mouse)
Description:P33534
Residue:380
BDBM50274520
NameBDBM50274520
Synonyms:(2E)-N-[(5R,6R)-17-(Cyclopropylmethyl)-4,5-epoxy-3,14-dihydroxymorphinan-6-yl]-3-(furan-3-yl)prop-2-enamide | CHEMBL484582
TypeSmall organic molecule
Emp. Form.C27H30N2O5
Mol. Mass.462.5375
SMILESOc1ccc2C[C@H]3N(CC4CC4)CC[C@@]45[C@@H](Oc1c24)[C@@H](CC[C@@]35O)NC(=O)\C=C\c1ccoc1